viewing paste Unknown #12199 | Text

Posted on the
1 2 3 4 5 6 7 8 9 10 11 12 13 14 15 16 17 18 19 20 21 22 23
15:36:07 | arm-oe-linux-gnueabi-libtool: link: arm-oe-linux-gnueabi-gcc -march=armv7-a -mthumb-interwork -mfloat-abi=softfp -mfpu=neon -mtune=cortex-a9 --sysroot=/var/lib/jenkins_devel/workspace/CI_BSP/CI_BSP-build/tmp/sysroots/eagle-imx6 -O2 -pipe -g -feliminate-unused-debug-types -DRPM_VENDOR_WINDRIVER -DRPM_VENDOR_POKY -DRPM_VENDOR_OE -fPIC -DPIC -Wall -W -Wpointer-arith -Wstrict-prototypes -Wmissing-prototypes -Wno-char-subscripts -Wno-unused-parameter -Wformat-security -g3 -fno-delete-null-pointer-checks -D_FORTIFY_SOURCE=2 -fstack-protector -fexceptions -fexceptions -Wno-missing-field-initializers -D_GNU_SOURCE -D_REENTRANT -Wl,-O1 -Wl,--hash-style=gnu -o .libs/tset tset.o  -L/var/lib/jenkins_devel/workspace/CI_BSP/CI_BSP-build/tmp/sysroots/eagle-imx6/usr/lib ./.libs/librpmio.so -L../syck/lib -L../syck /var/lib/jenkins_devel/workspace/CI_BSP/CI_BSP-build/tmp/work/cortexa9-vfp-neon-oe-linux-gnueabi/rpm/5.4.9-r63/build/misc/.libs/librpmmisc.so ../misc/.libs/librpmmisc.so /var/lib/jenkins_devel/workspace/CI_BSP/CI_BSP-build/tmp/sysroots/eagle-imx6/usr/lib/libacl.so /var/lib/jenkins_devel/workspace/CI_BSP/CI_BSP-build/tmp/sysroots/eagle-imx6/usr/lib/libattr.so /var/lib/jenkins_devel/workspace/CI_BSP/CI_BSP-build/tmp/sysroots/eagle-imx6/usr/lib/libpcreposix.so /var/lib/jenkins_devel/workspace/CI_BSP/CI_BSP-build/tmp/sysroots/eagle-imx6/usr/lib/libdb-5.3.so /var/lib/jenkins_devel/workspace/CI_BSP/CI_BSP-build/tmp/sysroots/eagle-imx6/usr/lib/libmagic.so /var/lib/jenkins_devel/workspace/CI_BSP/CI_BSP-build/tmp/sysroots/eagle-imx6/usr/lib/libbeecrypt.so -lrt -ldl /var/lib/jenkins_devel/workspace/CI_BSP/CI_BSP-build/tmp/sysroots/eagle-imx6/usr/lib/libstdc++.so -lm /var/lib/jenkins_devel/workspace/CI_BSP/CI_BSP-build/tmp/sysroots/eagle-imx6/usr/lib/libbz2.so -lpthread -lelf /var/lib/jenkins_devel/workspace/CI_BSP/CI_BSP-build/tmp/sysroots/eagle-imx6/usr/lib/libpopt.so -lz -lssl -lcrypto /var/lib/jenkins_devel/workspace/CI_BSP/CI_BSP-build/tmp/sysroots/eagle-imx6/usr/lib/libpcre.so /var/lib/jenkins_devel/workspace/CI_BSP/CI_BSP-build/tmp/sysroots/eagle-imx6/usr/lib/libossp-uuid.so
15:36:07 | ./.libs/librpmio.so: undefined reference to `libiconv'
15:36:07 | ./.libs/librpmio.so: undefined reference to `libiconv_close'
15:36:07 | ./.libs/librpmio.so: undefined reference to `libiconv_open'
15:36:07 | collect2: error: ld returned 1 exit status
15:36:07 | make[4]: *** [tset] Error 1
15:36:07 | make[4]: Leaving directory `/var/lib/jenkins_devel/workspace/CI_BSP/CI_BSP-build/tmp/work/cortexa9-vfp-neon-oe-linux-gnueabi/rpm/5.4.9-r63/build/rpmio'
15:36:07 | make[3]: *** [all-recursive] Error 1
15:36:07 | make[3]: Leaving directory `/var/lib/jenkins_devel/workspace/CI_BSP/CI_BSP-build/tmp/work/cortexa9-vfp-neon-oe-linux-gnueabi/rpm/5.4.9-r63/build/rpmio'
15:36:07 | make[2]: *** [all] Error 2
15:36:07 | make[2]: Leaving directory `/var/lib/jenkins_devel/workspace/CI_BSP/CI_BSP-build/tmp/work/cortexa9-vfp-neon-oe-linux-gnueabi/rpm/5.4.9-r63/build/rpmio'
15:36:07 | make[1]: *** [all-recursive] Error 1
15:36:07 | make[1]: Leaving directory `/var/lib/jenkins_devel/workspace/CI_BSP/CI_BSP-build/tmp/work/cortexa9-vfp-neon-oe-linux-gnueabi/rpm/5.4.9-r63/build'
15:36:07 | make: *** [all] Error 2
15:36:07 | ERROR: oe_runmake failed
15:36:07 | WARNING: /var/lib/jenkins_devel/workspace/CI_BSP/CI_BSP-build/tmp/work/cortexa9-vfp-neon-oe-linux-gnueabi/rpm/5.4.9-r63/temp/run.do_compile.1336:1 exit 1 from
15:36:07 |   exit 1
15:36:07 | ERROR: Function failed: do_compile (log file is located at /var/lib/jenkins_devel/workspace/CI_BSP/CI_BSP-build/tmp/work/cortexa9-vfp-neon-oe-linux-gnueabi/rpm/5.4.9-r63/temp/log.do_compile.1336)
15:36:07 NOTE: recipe rpm-5.4.9-r63: task do_compile: Failed
15:36:07 ERROR: Task 574 (/var/lib/jenkins_devel/workspace/CI_BSP/Eagle-Distribution/oe-core/meta/recipes-devtools/rpm/rpm_5.4.9.bb, do_compile) failed with exit code '1'
15:36:11 NOTE: recipe gst-plugins-gl-0.10.3-r5: task do_compile: Succeeded
15:36:13 NOTE: recipe rpm-native-5.4.9-r63: task do_compile: Succeeded
15:46:14 NOTE: recipe visteon-apps-4.3.9-r2: task do_compile: Succeeded
Viewed 612 times, submitted by unknown.