viewing paste Unknown #17547 | Text

Posted on the
1 2 3 4 5 6 7 8 9 10 11 12 13 14 15 16 17 18 19 20 21 22 23 24 25 26 27 28 29 30
In file included from socket.c:9:
socket.h:10: error: expected ‘=’, ‘,’, ‘;’, ‘asm’ or ‘__attribute__’ before ‘is_gepard_active’
socket.h:11: error: expected ‘=’, ‘,’, ‘;’, ‘asm’ or ‘__attribute__’ before ‘min_allowed_gepard_version’
socket.h:34: error: expected specifier-qualifier-list before ‘bool’
socket.h:84: error: expected declaration specifiers or ‘...’ before ‘uint16’
socket.h:86: error: expected ‘=’, ‘,’, ‘;’, ‘asm’ or ‘__attribute__’ before ‘gepard_process_packet’
socket.h:87: error: expected ‘)’ before ‘*’ token
socket.c: In function ‘WFIFOSET’:
socket.c:750: error: ‘is_gepard_active’ undeclared (first use in this function)
socket.c:750: error: (Each undeclared identifier is reported only once
socket.c:750: error: for each function it appears in.)
socket.c:752: warning: implicit declaration of function ‘gepard_process_packet’
socket.c: At top level:
socket.c:1837: error: conflicting types for ‘gepard_process_packet’
socket.c:752: note: previous implicit declaration of ‘gepard_process_packet’ was here
socket.c: In function ‘gepard_process_packet’:
socket.c:1847: warning: implicit declaration of function ‘gepard_enc_dec’
socket.c:1853: error: ‘struct gepard_info_data’ has no member named ‘sync_tick’
socket.c:1864: error: ‘struct gepard_info_data’ has no member named ‘is_init_ack_received’
socket.c:1867: error: too many arguments to function ‘gepard_init’
socket.c:1887: error: ‘struct gepard_info_data’ has no member named ‘is_init_ack_received’
socket.c:1914: error: ‘struct gepard_info_data’ has no member named ‘is_init_ack_received’
socket.c:1915: error: ‘struct gepard_info_data’ has no member named ‘unique_id’
socket.c:1916: error: ‘struct gepard_info_data’ has no member named ‘gepard_shield_version’
socket.c: At top level:
socket.c:1987: error: conflicting types for ‘gepard_init’
socket.h:84: note: previous declaration of ‘gepard_init’ was here
socket.c:2010: warning: conflicting types for ‘gepard_enc_dec’
socket.c:1847: note: previous implicit declaration of ‘gepard_enc_dec’ was here
make[1]: *** [obj_all/socket.o] Error 1
Viewed 720 times, submitted by milk.